﻿CERTTYPE,DTH_DATE,DTH_DAY,DTH_MNTH,DTH_YR,STAGE1_W,STAGE2_W,C_AGEP,C_ANC1P,C_ANC2P,C_ASSNP,C_BEDD,C_BEDD99,C_BEDRD,C_BPFP,C_BPLP,C_BPMP,C_CACF,C_CDCAF,C_CDCF,C_CDEP,C_CDSAF,C_CHCARE,C_CITP,C_CNDAF,C_CNDCF,C_CPAD,C_CPAF,C_CPRF,C_CTGP,C_CTPP,C_DLOD,C_DOMP,C_DWTD,C_EMPP,C_EMTP,C_ENGLP,C_ENGP,C_FBLF,C_FIDF,C_FINASF,C_FINF,C_FMCF,C_FNOF,C_FRLF,C_GNGP,C_HCFMD,C_HCFMF,C_HEAP,C_HHCD,C_HIDD,C_HIED,C_HINASD,C_HIND,C_HRSP,C_HRWRP,C_HSCP,C_IFAGEP,C_IFMSTP,C_IFNMFD,C_IFPURP,C_INCP,C_INDP,C_INGP,C_LANP,C_LFHRP,C_LFSF,C_LFSP,C_LLDD,C_MDCP,C_MRED,C_MRERD,C_MSTP,C_MTWP,C_MV1D,C_MV5D,C_NEDD,C_NPDD,C_NPRD,C_OCCP,C_QALFP,C_QALLP,C_RELP,C_RLCP,C_RLGP,C_RLHP,C_RLNP,C_RNTD,C_RNTRD,C_RPIP,C_SAFD,C_SEXP,C_SLPP,C_SPLF,C_SSCF,C_STRD,C_STUP,C_TEND,C_TENLLD,C_TISP,C_TISRP,C_TYPP,C_TYSTAP,C_UAI1P,C_UAI5P,C_UAICP,C_UNCARE,C_VEHD,C_VEHRD,C_VOLWP,C_YARP,C_YARRP,IAREA_11,IEO_11,IER_11,IRSAD_11,IRSD_11,LGA_11,MCOD_1,MCOD_2,MCOD_3,MCOD_4,MCOD_5,MCOD_6,MCOD_7,MCOD_8,MCOD_9,MCOD_10,MCOD_11,MCOD_12,MCOD_13,MCOD_14,M_AGEP,M_BPLP,M_INGP,M_IRSAD,M_IRSD,M_IRSPD,M_MSTP,M_RA,M_SA2,M_SEXP,M_STATE,M_YARP,RA_UR_11,REGSTATE,SA2CD_11,SA2CP_11,UCOD
1,29NOV2011:00:00:00,8,8,2012,1.238301676,1.198999646,79,2101,,2,2,,3,1,1101,1,,,0,,,2,1,,9,,0,,,,,1,1,,,1,2,,,9,14,9222,1,,,12,,67,320,3,10,,,,,3,1,1,,1,,,,1201,7,23,6,,1,,,5,,3,1,1,,2,,,,2001,,10,15,2,,,1,,2,,,,11,1,1,2,,,,,1,1,1,,1,2,1,1969,,104021,1,4,1,5,51820,W010,C793,J81,,,,,,,,,,,,69,1101,1,3,4,3,2,40,401051017,1,1,XXXX,12,2,124031464,305031131,C73
1,19DEC2011:00:00:00,19,8,2011,1.238301676,1.18876619,57,1101,,1,5,,4,,1101,,2,,,,,3,1,,,,,2,,,5,1,1,,,1,,,1,,,,,,,,,622,110,1,,7,9,,,1,1,1,,1,11,,1,1201,7,,6,,3,,,5,,3,3,2,,2,,,310,2331,1,73,,,,4,5,,1,,1,,91,1,1,1,,,32,,1,,1,2,0,1,,1937,6,202004,10,4,10,9,14950,C61,,G912,M069,,,,,,,,,,,76,1101,1,8,6,5,1,20,603031074,2,1,XXXX,30,5,118011345,104021085,J449
1,24FEB2012:00:00:00,23,12,2012,1.238301676,1.153458891,88,2101,2102,1,3,4,,2,,2,,,,,,1,1,,,,0,2,,,5,4,1,,,1,1,,,,,,,,,12,11,67,110,1,,,7,,,,1,1,1,1,5,,1,,7,19,6,,3,,8,5,,,3,2,,2,,40327,,2331,,,,2,,,,,1,,1,,11,1,1,1,,2,,,2,2,1,1,2,2,1,,,104007,5,2,4,2,27450,C169,C349,,I469,,,,,,,,,,,89,2105,1,4,1,3,5,50,319021506,1,8,XXXX,50,1,316021422,403021061,C220
1,11MAY2012:00:00:00,9,5,2012,1.286022278,1.465330364,92,2102,,1,4,,4,1,1101,2,,,,,,2,1,,,,0,,,,5,4,1,,,1,3,,3,,5,,,,,26,11,67,,1,7,9,2,,,4,1,1,1,1,,,1,1201,7,,,20,,,14,5,,,1,2,,,,,,7010,,73,73,,,,,,1,,,,11,1,,1,4,4,,,1,1,1,1,,1,1,1971,5,201010,4,2,5,2,16380,C859,F03,,,,,,,,,,,,,52,1101,1,1,5,1,2,10,210031239,1,6,XXXX,11,1,124031457,203021041,C349
1,10FEB2012:00:00:00,30,3,2012,1.194718455,1.250283543,53,2101,,1,2,2,,1,1101,1,,,,,,,1,,1,0,,2,,,5,,3,,,1,5,,1,6,8,,1,,,,11,611,,1,5,9,12,,,1,1,1,1,1,10,,1,1201,7,19,6,,3,,,5,234,3,3,,11,,7110,,,2331,,73,73,,,,,,2,,,,11,,1,,,2,50,,1,1,1,1,0,,,1957,,201006,8,1,3,10,31000,F03,T71,N189,,,,,,,,,,,,83,1101,1,5,6,3,,31,313021365,2,1,XXXX,30,3,116031317,305031123,J984
1,10MAR2012:00:00:00,3,2,2012,1.286022278,1.229202901,98,1101,3103,1,,,3,1,1101,1,,,,,,1,2,,,0,,2,,,5,1,1,,,1,,,1,,,,1,,,13,,621,310,,5,8,12,,,3,1,1,,1,4,,1,1201,7,,2,,,,,1,,,,1,,2,,69907,,2012,1,,,,,,,,2,,,3,11,1,4,,4,2,,,,2,1,1,1,2,1,,,104011,4,8,10,10,23940,C189,I10,,,,,,,,,,,,,83,3207,1,2,5,3,2,31,502011025,2,1,XXXX,32,2,121031407,123031447,G122
1,15DEC2011:00:00:00,15,4,2011,1.222101528,1.270087587,54,,,1,,,3,2,1101,1,,,,,,1,1,,,,0,2,,,5,5,1,,,1,,,1,,6,1222,1,,,,12,621,310,1,,,,,,4,1,1,1,1,5,,1,1201,,,6,,2,,,2,,3,3,1,,1,,,,,1,,11,,,3,,,1,,,3,31,1,,1,,3,,,2,,1,2,,0,1,,,507014,7,10,1,3,33220,I219,K746,I259,R53,,,,,,,,,,,45,1101,1,4,9,3,3,32,120031390,2,3,XXXX,10,3,117031332,108041164,J189
1,13SEP2012:00:00:00,27,9,2012,1.222101528,1.308999592,87,1101,,2,2,3,,2,1101,2,,,,,,1,1,,,1,,3,,,5,1,1,,,1,,,,8,,,,,,31,12,,,1,,12,10,,,,1,1,,1,7,3020,1,1201,7,26,6,,1,,,5,,,,2,,1,,,,2012,1,,,2,,,1,,1,,,3,,1,1,1,,2,,,1,1,1,1,3,1,1,,3,601002,7,8,5,1,45040,F03,T404,I48,,,W809,,,,,,,,,78,1101,1,3,3,1,5,61,316011416,2,2,XXXX,10,3,505011079,119031368,E119
2,29FEB2012:00:00:00,28,5,2012,1.238301676,1.142581793,50,2101,,1,2,3,2,1,1101,2,1,,,,,1,1,,,,0,,,,5,,1,,,1,,,1,11,9,1222,,,4,,13,,310,1,5,8,5,,,3,1,1,,4,,,1,1201,,,6,,,,,3,6,,,1,,,7100,,514,2251,,21,11,2,,,,,1,,1,,21,1,1,,,,,,1,1,1,1,,0,1,,2,107024,1,1,1,1,36510,C159,I10,,,,,,,,,,,,,78,1101,1,1,6,1,2,20,112021247,1,2,1968,42,1,120011386,110021193,C170
1,30SEP2011:00:00:00,17,1,2012,1.188585608,1.33037298,55,1101,,2,,,3,,,,,,,,,2,1,,,0,0,,,,5,3,1,,,1,,,1,,3,1222,1,,,31,,,,1,7,6,,,,5,1,1,1,1,5,8219,1,1201,7,10,6,,,4333,,5,,3,2,,,1,,,,2012,,10,11,,,,,,1,,1,3,11,1,1,1,,3,,,1,2,1,1,1,2,1,,,202002,3,4,4,3,36710,F03,A419,I48,,,R688,,,,,,,,,65,1101,1,5,2,2,5,50,313041375,2,5,XXXX,20,5,404011095,208021178,C349
1,03JUN2012:00:00:00,22,12,2012,1.398262129,1.301572266,76,,,2,4,3,3,,1101,1,,,,,,1,1,,,,0,3,,,,5,1,,,1,5,,,,,3221,1,,,11,,,110,1,13,,5,8,,3,1,1,,1,7,,1,1201,7,26,1,10,,,,1,,3,,1,,1,,,,2251,,,21,,,,5,,2,,,3,,1,1,,,2,,,2,1,2,,,,1,,5,301002,7,2,2,4,17050,E039,E141,,M819,,,,,,,,,,,66,1101,1,8,3,2,2,11,116011304,1,1,XXXX,32,3,505031103,301021012,K430
1,13MAR2012:00:00:00,15,8,2012,1.263392857,1.179076616,87,2101,,1,,3,4,1,1101,,,,,,,1,1,,,,,,,,,,3,,,1,,,,,10,,,,,,,621,,1,,3,11,,,,1,1,1,1,6,,1,1201,7,,6,,3,,,2,,3,,,,4,,,,2071,,,11,,,,4,,1,,1,,11,1,2,,3,,,,1,2,1,1,2,2,1,2002,,104013,2,2,1,2,36360,F03,I694,F03,,I48,,,,,,,,,,53,1101,1,7,10,3,2,40,505021094,2,2,XXXX,20,1,508051210,101031016,C169
2,16JAN2012:00:00:00,12,3,2012,1.194718455,1.137240668,84,1101,,1,2,,4,2,1101,1,1,,,,,1,1,,,,0,,,,5,1,3,,,1,,,,6,,,,,4,,11,67,,3,12,11,7,,,5,1,1,1,1,5,,1,1201,7,19,6,,,,,2,,3,,,12,,2522,30700,,1011,,10,,2,,,4,,1,,1,,,1,1,,0,4,,,2,,1,1,2,1,1,1949,,107013,2,5,1,2,10350,E780,I200,,S420,,,,,,,,,,,46,1101,1,3,4,3,2,20,306041165,1,8,XXXX,20,2,112011236,213031347,C509
1,09SEP2012:00:00:00,8,1,2012,1.541666667,1.198573301,79,1101,,1,,3,3,1,1101,2,,,,,,1,1,0,,0,0,,,,,,1,,,1,5,,,,,2221,,,,,11,,110,1,8,11,18,,,2,1,1,1,1,2,,1,1201,7,,6,,3,,,1,,,,2,,,,80301,,,,72,,,,,4,,1,,,,,1,,1,6,,,,1,1,1,1,,1,1,1968,,104007,7,5,2,5,36510,I219,,J849,J969,I509,,,,,,,,,,82,1101,1,10,3,2,2,11,306011141,2,5,1944,10,1,304031093,102011043,N189
1,21MAR2012:00:00:00,7,9,2011,1.194718455,1.253759651,78,2101,,1,4,3,,1,1101,2,,,,,,1,1,,,,0,,,,5,1,3,,1,1,,1,1,8,,1222,1,,,,11,514,211,,,7,,,7,1,1,1,,1,7,,1,1201,,,,,1,,,5,,3,,1,,,,,,2012,1,31,11,2,,,5,,2,,1,3,32,1,4,,,,,,1,1,1,1,1,,1,,,201010,4,5,9,1,57910,J690,D649,I219,,R630,,,,,,,,,,66,1101,1,6,4,2,2,11,120031396,1,1,XXXX,20,2,108021159,105031101,I420
1,20JUL2012:00:00:00,4,1,2012,1.247105991,1.221534506,64,2201,,1,3,,3,1,2403,2,,,,,,1,,,,,0,,,,,2,1,,,1,,,5,,8,,1,,,31,12,611,110,,7,7,9,,,1,1,2,,1,5,,1,6401,7,,,40,1,,,5,,3,,1,,1,,,514,2171,1,61,,,,,4,,1,,1,3,,1,1,4,,3,,,2,1,1,1,2,0,,,,401018,1,5,8,4,35010,C859,E119,,,,J969,,,,,,,,,84,1101,1,0,6,5,1,30,401041016,1,1,XXXX,12,2,213021343,216011406,G309
1,03FEB2012:00:00:00,15,8,2012,1.234275963,1.185998966,90,2306,,2,,1,,1,1101,1,,,,,,,1,,,0,0,,,,5,1,1,,,1,,,1,,8,,,,,11,,310,110,1,6,6,,,,3,1,1,,1,6,,1,2201,7,19,6,,1,,,1,,3,,,11,,,60301,,2012,,62,11,,,,4,,1,,,,,,2,3,,4,,,1,,1,,,,1,,,201015,5,8,9,5,25250,K559,I10,I110,K566,J969,,,,,,,,,,64,1101,1,6,2,4,5,21,507011154,1,1,XXXX,10,3,211031267,319021505,C349
1,09SEP2011:00:00:00,18,8,2012,1.222101528,1.172320671,42,2101,,2,2,,,,1101,2,,,,,,1,1,,1,,0,5,,,5,3,3,,,2,5,,,7,6,1222,1,,,,,,,,6,5,8,,,5,1,1,,1,5,,1,1201,7,19,6,,,,,3,,3,,2,11,2,5612,,,7010,,,11,,,,1,,1,,,3,22,1,1,4,4,,,,2,,1,1,2,,,,,107025,2,3,7,2,24970,J988,,I279,,,,,,,,,,,,73,1101,1,4,4,1,2,50,114011279,1,4,XXXX,20,4,313051379,301031020,I219
1,09AUG2012:00:00:00,7,8,2012,1.238301676,1.238336722,34,2101,,1,,,3,1,,2,,,1,,,1,1,,,1,,,,,,,3,,,1,2,,1,7,,,,,,,,511,310,1,11,,8,,,3,1,1,,1,4,,1,1201,7,2,6,,1,1200,,5,,3,,2,,,3514,,514,2012,,10,71,2,82,,,,2,,1,,11,1,1,1,2,,,,1,1,1,1,1,,1,,,308012,6,1,4,6,18000,J448,J47,I469,,,,,,,,,,,,83,1101,1,3,10,2,5,21,121041414,1,6,XXXX,50,2,209041218,601031013,C140
2,24APR2012:00:00:00,12,5,2012,1.247105991,1.205248919,72,1101,,2,3,,3,1,1101,,,,,,,1,1,,8,0,,2,,,4,1,1,,,1,,,1,,9,1222,,,4,31,11,67,110,,,4,,,,3,1,1,,1,,,1,2401,7,,6,32,3,,,2,,3,,1,7,2,,,,2071,,,11,,,,4,,2,,1,3,,1,1,,0,,,,1,2,2,1,,,1,,,505014,7,5,1,2,24970,I499,,,,,,,,,,,,,,80,1101,1,2,2,5,2,50,127021511,1,1,XXXX,10,1,601051029,110031196,D469
1,04SEP2012:00:00:00,3,1,2011,1.218504811,1.462471745,87,1101,,2,,5,3,,,1,,,,,,1,1,,,,,,,,,4,1,,,1,,,,,7,,1,,,11,,622,,,5,,,,,1,1,1,1,1,6,,1,,7,,6,,3,,,2,,3,3,1,7,1,,30107,,2331,,10,15,,,,4,,1,,,,,1,1,4,2,2,,,1,1,1,2,,,1,,,201016,10,1,7,8,71000,N180,,I500,,,R688,,,,,,,,,87,3307,1,4,9,3,5,22,701011006,1,3,XXXX,30,5,316021422,212041311,I802
1,12APR2012:00:00:00,12,10,2012,1.247105991,1.198750065,20,2101,,1,3,3,,1,1101,2,,,,,,1,1,,,,0,2,,,5,2,3,,,1,2,,1,6,7,1222,1,,,13,,621,110,1,7,5,12,,,,1,1,1,1,4,,1,1201,7,,6,,1,3800,,2,,,3,1,11,5,,,514,7010,,21,21,2,0,,5,,1,,1,,,1,1,1,,,,,1,1,1,1,,1,1,,8,105016,4,8,6,1,17550,I219,F03,I10,,,,,,,,,,,,88,1201,1,3,3,2,5,12,404011090,1,1,XXXX,20,2,115011293,102011042,F03
1,23APR2012:00:00:00,9,12,2012,1.201923077,1.345871236,47,,,1,,4,,1,1101,,,,,,,1,1,,,,0,2,,,5,1,1,,,1,2,,,10,9,,1,,,,,621,110,,9,6,17,,2,1,1,1,1,1,5,,,1201,7,,6,,3,,,2,,3,3,1,11,,,,,2331,1,,21,,140,,,,2,,,3,11,1,,,,,,,1,1,1,1,,,1,1958,,507002,1,2,1,8,23670,I259,,,R048,,W809,,,,,,,,,91,1101,1,10,1,5,5,20,318021484,1,6,XXXX,10,5,208041194,213011335,C20
1,11JAN2012:00:00:00,18,3,2012,1.222101528,1.21768429,73,1101,,1,3,,3,1,1101,1,,,,,,1,1,,,,0,,,,,1,1,,,1,1,,1,9,,1222,1,,,31,11,411,,1,7,13,5,,,5,1,1,1,1,4,,1,1201,7,,6,,1,,,2,,,1,2,,,,,,2071,,,21,,,,1,,1,,,,,1,1,1,,3,,10,1,2,1,1,1,,,,,201015,2,3,9,2,22670,M069,N179,,I279,,,,,,,,,,,80,1101,1,1,7,1,,22,116021311,1,3,XXXX,10,2,506031124,119011354,C349
1,08SEP2011:00:00:00,12,9,2012,1.346466809,1.244391995,90,1101,,2,1,2,2,1,1101,1,1,,3,,,1,1,,,0,0,2,,,,1,3,,,1,3,,,7,8,3221,,,,,,611,110,1,7,11,8,,,,1,1,1,1,4,,1,1201,7,,6,,3,,,5,,,,1,,2,,,514,2071,,69,21,,,,,,1,,1,,,1,4,,3,0,,,1,,1,,,2,,,7,201013,5,2,2,1,16350,C259,E86,I802,,N189,,,,,,,,,,71,2304,1,3,5,1,2,10,311011305,2,4,1958,20,2,303051076,310031287,C509
2,15SEP2012:00:00:00,27,7,2012,1.398262129,1.299599828,86,2101,,1,,3,,2,2105,1,,,,,,1,1,,,0,,2,,,5,3,1,,,1,2,1,,,,,,,,31,,,110,1,,,,,,3,1,1,,1,4,,1,1201,7,,6,,1,,,5,,3,,2,7,1,,,,2331,1,,,2,,3,,,1,,,3,,1,,2,4,1,,,1,1,1,2,1,1,1,,,107024,7,1,5,3,51820,J984,,,,,,,,,,,,,,85,1101,1,5,1,1,3,20,209041225,1,2,XXXX,20,1,207011148,311041321,J449
1,26FEB2012:00:00:00,28,8,2011,1.247105991,1.223900506,67,1101,1101,1,,2,,1,4203,1,1,,1,,,1,1,,,,,,,,5,1,1,,,3,,,1,,,,1,,,12,12,,110,1,6,5,9,,,,1,1,1,1,4,,1,1201,7,,1,,1,,,5,,,3,2,11,1,,40309,310,7010,,,64,,,,1,,2,,1,,21,1,1,,,2,,,1,1,1,1,3,1,,,5,505005,1,1,1,1,45890,C73,A419,G459,,,,,,,,,,,,93,4208,1,5,2,2,5,72,106041129,2,2,XXXX,10,4,506041137,104021091,I64
2,22SEP2011:00:00:00,7,7,2012,1.201923077,1.223900506,89,2101,,2,,4,,,1101,2,,,,,,1,,,1,0,0,3,,,5,1,1,,1,1,5,,,13,11,,,,,12,,67,,,11,,3,,,4,1,1,1,1,6,7530,1,,7,19,6,,,867,,5,,3,,2,11,1,,,11,2012,1,,73,,,3,5,,1,,,,,1,1,1,0,,,,1,2,1,1,2,0,1,1956,,201005,1,6,1,7,22170,C509,T751,J189,I10,,,,,,,,,,,57,2102,1,2,4,1,2,20,216011410,2,5,XXXX,10,3,508051210,801061067,I48
1,06OCT2011:00:00:00,16,10,2012,1.222101528,1.281301557,54,9201,,1,,0,,2,1101,1,1,,,,,1,1,1,,0,,,,,5,1,3,,,1,,,1,,7,,,,,,13,621,110,,,,,,,5,1,1,1,1,7,,1,1201,7,,6,,3,,,3,,3,,2,,,,,,2071,,73,,2,,,1,,1,,,3,11,1,1,1,6,,,,1,1,1,1,,,2,1948,,505003,5,6,6,4,40910,C329,,,,I500,,,,,,,,,,78,1101,1,3,3,0,2,21,311061334,1,1,XXXX,10,2,209041219,401061022,J449
1,07MAR2012:00:00:00,4,4,2012,1.247105991,1.18876619,70,1101,,,5,,3,1,1101,2,,0,,,,1,1,,,0,0,,,,5,1,1,,,1,,,,15,,1222,1,,,12,11,621,110,1,5,,5,,,,1,1,1,1,6,,1,1201,,,6,31,3,,,1,,3,1,,,6,,,,2012,1,61,73,2,42,,4,,2,,1,,,1,1,1,,,,,1,1,1,1,,0,1,,5,301007,2,5,1,7,21110,I48,I698,I10,,,,,,,,,,,,91,1101,1,3,4,2,5,40,317011446,1,4,XXXX,10,2,401061022,403021058,K290
1,02APR2012:00:00:00,3,1,2012,1.188585608,1.183067353,87,,,1,3,4,,1,1101,,,,,,,,1,,,0,0,2,,,5,1,1,,,1,2,,,7,,2221,,,,31,,613,,1,,7,,,,5,1,1,1,1,5,3020,1,1201,7,,1,,3,1300,,5,,,1,2,,4,,,110,2071,,,11,,225,,1,,2,,1,,11,1,1,,,,,,1,1,1,1,,,1,,,104007,10,8,1,2,11520,A419,J969,I10,,,,,,,,,,,,75,2105,1,5,3,3,5,10,111021215,1,1,XXXX,31,4,316041432,210051244,C269
1,28OCT2011:00:00:00,5,4,2012,1.25777512,1.193515052,52,1101,,1,3,3,,1,3200,2,,,,,,1,1,,,,,,,,,3,3,,,1,,,1,6,,,,,,,,,,1,,6,,,,4,1,1,1,1,3,6720,1,1201,7,19,6,,3,,,2,,,3,,,2,,,,2031,,91,,,,,,,1,,,3,11,,,1,,2,,,2,1,1,1,,,2,,,107028,1,3,1,2,18000,I609,R092,I500,J189,,,,,,,,,,,62,1101,1,3,2,2,2,21,506071145,1,4,XXXX,29,1,127031525,112021248,I719
1,01SEP2011:00:00:00,27,2,2012,1.286022278,1.180849589,91,1101,,1,,3,4,1,1101,2,,,,,,1,1,,,,,4,,,5,3,3,,,1,,,1,,,,,,,12,,,310,1,5,5,,,,5,1,1,,1,,,,1201,,23,6,,,,,5,,3,,,,3,,,,2071,,10,11,,,,4,,2,,,,21,1,1,4,,,,,,1,1,1,,2,1,,,401002,10,7,4,5,10900,C80,E86,I469,,,,,,,,,,,,73,1101,1,2,6,5,5,40,505021084,1,1,XXXX,11,5,316021423,301021007,I219
1,15APR2012:00:00:00,3,3,2011,1.238301676,1.252103499,86,2101,,1,3,4,,2,1101,,,,,,,1,1,,0,0,0,,,,5,4,1,,,1,,,1,6,,,,,,,,621,110,,11,,,,,3,1,1,,1,4,,1,1201,2,10,6,20,,,,2,,3,,1,,2,,,,2071,2,73,,2,,,4,,2,,1,,,1,,1,,,,,1,1,1,1,,1,,,4,202019,1,2,7,7,12900,C927,F03,I259,F106,,,,,,,,,,,86,1101,1,6,9,4,3,20,205041095,1,3,1967,41,6,208011171,216021414,X700
2,24AUG2011:00:00:00,13,11,2011,1.201923077,1.137240668,75,2101,,2,,3,,1,1101,2,,,,,,2,1,,,0,0,6,,,,3,3,,3,2,,,1,,,,,,,31,,622,110,1,,7,,,,4,1,1,1,1,5,,1,1201,7,,,,3,,,1,,,,2,,,,,521,2012,1,10,,2,,,1,,2,,1,3,11,1,,7,,,,,1,1,1,1,,0,1,,,301007,3,3,6,2,16350,X709,J439,,J988,,,,,,,,,,,84,1101,1,5,2,2,5,20,118021352,2,3,XXXX,10,1,122021420,112031255,W199
1,22DEC2011:00:00:00,26,9,2012,1.238301676,1.33037298,75,2303,,2,2,3,,1,1101,2,,,,,,,1,0,,0,,,,,5,,3,,,1,,,,,,,,,,12,,67,320,1,,8,,,,,1,1,1,1,,,1,1201,7,,6,,3,,,4,,3,3,,,,,60501,,2331,,73,73,2,,,5,,1,,1,3,11,1,4,1,,0,,,1,,1,1,1,,1,,,201010,5,4,1,8,31000,W011,I10,,I500,,,,,,,,,,,82,1101,1,8,8,1,5,10,314011386,2,4,XXXX,30,1,505011070,201011004,G319
2,05NOV2011:00:00:00,19,6,2011,1.188585608,1.190775352,57,2101,,2,3,2,3,1,6101,2,,,,,,1,,,0,,0,,,,5,3,1,,,1,1,,,,,,1,,,,,67,110,1,,6,,,7,1,1,1,1,1,5,,1,1201,7,,6,,1,,,5,,,3,,11,5,7119,30711,,2071,1,21,11,,,,,,2,,,,11,,,1,,,,,1,2,1,1,1,2,1,,,107006,1,8,2,1,63610,I64,I469,E669,,,,,,,,,,,,98,1101,1,5,2,4,5,20,501021006,1,4,XXXX,10,2,121021405,404031106,C459
2,26JUL2012:00:00:00,22,11,2012,1.234275963,1.220696468,74,,,1,6,,3,1,3200,,,,,,,1,1,,,0,0,,,,5,1,3,,,1,,,,11,,1222,,,,,11,67,310,,5,,17,,,3,1,1,1,1,4,,1,1201,7,19,6,,1,,,2,234,,3,,,,,60301,,7010,,91,11,2,175,,4,,2,,1,3,21,1,2,4,,4,,,1,1,1,,,1,1,,,403003,4,0,4,3,15900,C189,C793,I10,I64,,I469,,,,,,,,,72,1101,1,2,4,4,2,50,206011107,2,1,1923,20,1,601041023,113031269,I219
1,11AUG2011:00:00:00,14,3,2012,1.194718455,1.242570226,87,2101,,2,,,3,1,2102,,,,,,,,1,,2,0,0,,,,5,1,1,1,,1,,,,,,2122,,,,11,13,621,,1,7,,,,,5,1,1,,1,2,,1,1201,7,,6,,1,,,5,6,3,3,,,,,,500,2071,,,73,2,,,,,1,,1,3,91,1,,,,,,,1,1,1,1,3,2,1,,,201005,2,3,4,8,14900,N189,E213,J189,,,,,,,,,,,,89,1101,1,1,10,2,1,22,302021031,2,5,1957,11,1,402041046,311051323,I251
1,20FEB2012:00:00:00,10,2,2012,1.194718455,1.183060749,94,2101,2305,2,,3,3,1,1101,1,,,,,,1,1,,,0,0,3,,,5,5,1,,,1,,1,,,7,2212,1,,,,,613,,,,,7,,,3,1,1,1,1,,,1,1201,7,1,,20,,,,2,,,3,,,,,,,,,73,11,2,,,5,,1,2,1,,,1,4,,,,,,1,1,1,1,1,,,,,601003,1,2,3,8,20570,C349,,,I48,,,,,,,,,,,81,1101,1,1,8,4,2,XX,115011291,2,2,XXXX,20,2,108041163,401021003,J988
1,05NOV2011:00:00:00,16,1,2012,1.222101528,1.243258822,82,2101,,2,2,3,3,2,3105,2,,,,,,1,1,,1,,,,,,4,5,1,,,4,,,,,,,,,,23,,622,110,1,8,3,8,,1,3,1,1,1,1,,,1,1201,7,,1,,1,,12,1,,1,1,1,,,,,,7010,,21,11,2,,,,,2,,,,11,1,4,,0,,,,1,1,1,1,1,,1,1952,,107012,8,1,10,1,22750,C259,I10,J182,,,I694,,,,,,,,,76,2304,1,6,5,1,2,40,211031267,1,1,XXXX,10,3,316051438,309091266,I219
1,30APR2012:00:00:00,24,9,2012,1.218504811,1.222598095,89,2303,,,,3,,2,1101,1,,,,,,1,1,0,,0,0,,,,5,1,3,,,1,,,,,,2212,,,,,,621,110,1,7,,,,,1,1,1,1,1,5,,1,1201,7,,,,1,1083,,5,,3,3,1,11,2,,30000,,2012,,10,,2,,,,,2,,1,3,11,1,4,1,,,,,2,1,1,1,,1,1,1966,5,202008,1,3,2,2,21110,G309,I469,,I249,,,,,,,,,,,46,4204,1,10,2,1,5,XX,126011495,2,2,XXXX,10,1,801051052,318021488,G629
1,23NOV2011:00:00:00,16,4,2012,1.247105991,1.318072348,66,,,1,3,,2,2,2102,2,,,,,,1,1,,,,,2,,,5,1,3,,,5,,1,,,,,,,,31,,,,,7,8,14,,,4,1,1,1,1,11,,1,,1,,6,,3,,,3,,3,1,1,,,,,,,1,,11,2,,,4,,1,,1,,31,1,4,,3,,,,1,1,1,1,,,1,,2,202017,2,9,6,1,14800,F019,F322,F101,N289,,,,,,,,,,,43,3215,1,1,3,4,3,20,403041085,1,1,XXXX,31,6,309091266,602011043,C509
1,21AUG2011:00:00:00,26,12,2012,1.222101528,1.215853058,99,1101,,1,3,,3,1,1101,1,,,,,,,1,,,1,,2,,,5,,3,,,1,,,,6,,,,,,,,998,,,4,8,,,,3,1,1,1,1,5,,,1201,7,19,6,,1,,,5,,3,,2,,2,,,,2071,2,10,31,2,,,4,,2,,1,3,11,1,2,5,,1,,,1,2,1,1,1,,1,,,202008,1,2,2,5,27450,J449,C793,I269,,,,,,,,,,,,59,1101,1,2,10,2,5,31,202021029,1,2,XXXX,10,4,309031238,308031214,J690
1,04JUL2012:00:00:00,16,11,2011,1.15204918,1.246960613,84,2101,1101,2,3,3,,1,3104,2,,,,,,1,1,,,0,0,,,,5,2,1,,1,1,3,,,6,6,,1,,,31,13,,,,7,,11,,,2,1,1,1,1,4,,1,1201,,5,6,,1,,6,2,,,3,,7,,,,,2000,,73,11,,,,4,,2,,,,,1,,1,8,,,,1,,1,1,0,,1,1949,,201011,2,8,8,9,14550,C61,,,,,,,,,,,,,,84,1101,1,7,1,4,2,10,507051185,1,1,XXXX,31,3,303051075,207011148,I259
1,19SEP2012:00:00:00,18,5,2012,1.286022278,1.223900506,94,4106,,1,,3,3,,1101,1,,,,,0,1,2,,,0,,3,,,5,1,1,,,1,,,,10,,,1,,,,,1,110,1,4,8,,,,,1,1,1,1,,,1,1201,7,,6,,,,,2,,,3,1,8,5,,,,2012,,10,11,2,,,1,,1,,,,91,1,1,2,3,,,,1,1,1,1,1,3,1,,4,102010,10,1,5,4,21610,G122,,,,R090,,,,,,,,,,69,1101,1,7,4,3,2,40,405021116,2,2,XXXX,11,5,303031065,601031019,E119
1,10AUG2012:00:00:00,19,9,2012,1.234275963,1.167723117,57,1101,,1,,3,3,1,1101,1,1,,0,,,1,1,,,,0,,,,4,5,1,,,1,,,,,,2122,1,,,12,,,110,3,,7,18,,,1,1,1,1,1,10,,1,1201,7,19,6,,3,,,5,,3,3,2,,1,,,,2331,,,73,2,,,4,,1,,1,3,11,1,,,2,,,,1,1,1,1,2,1,1,1985,,107007,1,3,5,4,45680,C189,I712,I48,,,,,,,,,,,,73,1101,1,4,7,1,2,30,127031524,2,2,XXXX,20,1,104011082,102011040,J449
1,25APR2012:00:00:00,16,5,2012,1.194718455,1.252182363,90,3205,,1,3,6,3,1,1101,1,,,,,,1,1,,,,0,2,,,5,1,3,2,,1,3,,,,,,,,,31,11,621,310,,,13,,,,5,1,1,1,1,,,1,,7,,6,,3,,5,5,,3,3,,,2,,,310,2071,1,,72,,43,12,1,,2,,1,,21,1,,2,,,,,1,1,1,1,1,,1,,,201017,3,5,1,6,31900,C80,C260,,,,,,,,,,,,,75,1101,1,4,9,2,5,40,509021238,2,1,XXXX,11,5,505011078,508051212,E86
1,06APR2012:00:00:00,25,8,2012,1.218504811,1.266857271,90,3204,,2,3,3,3,,2102,2,1,,,,,1,1,,,0,0,2,,,5,3,3,,,1,,,,,,1222,1,,,12,11,411,,,,,,24,,1,1,1,1,1,10,,1,3602,7,,6,,,,,1,,3,3,2,,,,,,7010,1,10,11,2,,,1,,2,,,3,,1,,,,0,,,,1,1,1,,,1,,,104007,8,3,7,6,34590,C679,,,,,,,,,,,,,,94,1101,1,5,10,2,2,10,119041380,1,1,XXXX,10,3,108041163,102011039,N180
1,15JAN2012:00:00:00,22,6,2012,1.15204918,1.183484453,87,1101,2306,1,,5,1,1,3104,1,,,,,,,1,,,0,0,,,,,1,3,,,1,,,,,,1222,,,,,12,514,110,1,6,12,6,,,3,1,1,1,1,4,,1,2501,7,19,6,,,,1,5,,,3,,,1,,30700,,2071,,,11,2,,,5,,1,,,,,1,1,1,,,,,1,1,1,,0,2,1,,,301009,8,10,3,5,26610,O85,I509,N179,,,,,,,,,,,,83,1101,1,4,8,1,1,12,306011140,1,5,1952,10,1,119011361,217021430,I259
1,26SEP2011:00:00:00,26,5,2011,1.286022278,1.244160265,72,1101,,2,,,3,,1101,1,,,,,,1,1,,8,0,,,1,,5,1,3,,,1,,,,5,11,2221,,,,,11,67,110,3,,9,5,,,1,1,1,,1,6,,1,1201,1,,,,1,1733,,2,,3,,1,,2,,,,2071,2,,73,,,,1,,2,,,3,11,1,,,0,,,,1,1,1,1,2,1,,,,308013,8,4,7,4,17750,I672,,,,,,,,,,,,,,99,1101,1,3,2,5,2,21,208031188,2,2,XXXX,32,1,103011061,101041017,I678
1,10FEB2012:00:00:00,30,2,2012,1.238301676,1.237054374,66,1101,,1,3,,4,2,,2,,,,,,1,1,,,0,,,,,,1,3,,,6,,1,,,7,1222,1,,,,,67,,1,,16,2,,,,1,1,1,1,6,,1,1201,7,8,,,1,,,2,,3,3,,,1,,,514,2071,1,10,72,,60,,,,1,,,3,11,1,1,1,,,,,,,1,,,2,1,,,301003,4,8,3,9,16700,C509,I259,I341,,,,,,,,,,,,87,1101,1,7,1,4,5,20,211031264,2,1,XXXX,30,2,208031193,205041097,I219
1,06APR2012:00:00:00,30,7,2012,1.194718455,1.257864104,95,2101,2102,1,4,,,,2308,2,,,,,,,1,,,,,2,,,5,1,1,,1,1,,,,,,1222,,,,11,13,120,110,,11,,12,,,,1,1,,1,4,,1,,3,,6,,3,2167,,2,,,3,,,1,,,310,7010,1,21,11,2,,,5,,1,,,3,31,1,1,1,,,,,2,1,1,,1,3,1,,3,301007,10,6,6,2,23670,I219,I10,,,,,,,,,,,,,75,2102,1,4,8,3,2,42,214021382,1,5,XXXX,20,5,111031233,212041311,C349
1,24JAN2012:00:00:00,11,3,2011,1.238301676,1.21284088,57,3305,,1,4,,3,2,1101,1,,,,,,1,1,,,0,,,,,,3,1,,,1,,,1,,,,,,,,,67,310,,,8,,,,3,1,1,1,1,5,,,1201,7,,1,,,,,5,,,3,1,11,1,,,514,2251,,73,11,,65,,,,1,,1,,11,1,1,1,,,,,1,2,1,1,2,,1,,3,301008,5,10,1,6,60610,J690,I259,I634,R688,,,,,,,,,,,88,1101,1,8,3,3,2,22,316021417,1,1,XXXX,20,1,801091102,115011290,I330
2,10AUG2012:00:00:00,17,5,2011,1.15204918,1.33037298,89,3302,,1,2,,3,1,1101,2,,,,,,3,1,,,0,0,2,,,5,,3,,,1,,,,7,,,,,,,,,110,1,,6,4,,,1,1,1,1,1,5,,1,1201,1,19,6,,3,,16,5,,3,3,,,2,,,,2000,,,71,2,,,5,,1,,,,,,,1,,,,,1,1,1,1,2,1,,,,201017,1,2,4,5,47700,I350,I255,E149,J449,,,,,,,,,,,72,1101,1,8,7,4,5,31,203021047,2,4,XXXX,10,5,309091266,217011420,C189
1,24AUG2012:00:00:00,22,12,2012,1.222101528,1.234125002,80,1202,,1,,,4,1,8104,1,,0,,,0,,1,,,,,3,,,5,1,1,,,1,,,1,,9,,1,,,11,13,622,110,,,,,,,5,1,1,1,1,5,,1,1201,7,,6,,,,,1,,,,1,,,,,11,2012,,72,73,,,,1,,1,,,3,11,1,2,1,,,,,2,2,1,2,,,1,,,107030,10,3,5,5,11550,J449,C541,I509,S321,I500,,,,,,,,,,83,1101,1,4,2,1,5,50,101031014,1,2,XXXX,20,2,316031426,110011188,C509
1,12JAN2012:00:00:00,27,10,2012,1.188585608,1.302656751,89,1101,,1,3,3,1,1,1101,1,1,,,,,,1,,,0,,,,,5,1,3,,,6,2,,,,6,,1,,,31,,411,110,,4,7,,,1,3,1,1,1,1,6,,,1201,7,,6,,1,,,2,,1,3,,,3,,,110,2071,,10,11,,,,5,,2,,1,3,91,1,2,4,8,,,,1,1,1,1,,0,,,,201009,7,7,8,1,58330,F019,A419,,,,I249,,,,,,R688,,,64,1101,1,1,3,3,5,XX,128011530,2,4,XXXX,30,4,112021245,301021010,A415
1,13JAN2012:00:00:00,8,4,2012,1.238301676,1.21284088,96,,,2,3,2,3,2,,2,,,7,,,1,1,,,,,,,,,,3,,,1,,,1,,1,,1,,,,,514,,,13,,,,3,5,1,1,1,1,6,,1,1201,1,5,6,,1,,,2,,3,1,,,2,,30701,,7010,,10,,2,,,4,,1,,,,11,1,1,1,2,2,,,1,1,1,1,2,1,1,1970,,105022,3,2,1,3,15700,Y834,C61,,,,,,,,,,,,,56,2304,1,2,6,2,2,50,103031074,2,1,XXXX,40,6,207031162,308021198,C64
1,01NOV2011:00:00:00,17,8,2012,1.222101528,1.249349091,85,3103,,2,4,5,,,1101,1,,,,,,1,1,,,,,,,,5,1,1,,1,1,1,,,,8,,,,,11,,,310,1,10,8,,,,,1,1,1,1,4,919,1,1201,7,,6,,,,,5,,2,1,,12,8,,90305,,2071,1,91,,2,,,5,,1,,,3,11,1,,9,2,,,,1,2,1,,,2,1,,6,505006,5,3,7,4,36250,F03,I259,,,,,,,,,,,,,94,1101,1,2,10,3,5,10,312021349,1,3,XXXX,20,1,211031267,313021367,I64
1,24FEB2012:00:00:00,7,2,2011,1.218504811,1.224880374,69,1101,,1,,6,2,2,1101,1,1,,,,,1,1,0,,1,,,,,,1,1,,,1,,1,1,,,,,,,31,11,621,,3,,5,15,,,,1,1,1,1,4,,1,1201,,,6,,1,,,3,,3,,1,7,1,,,,2251,1,10,73,,,1,4,,2,,,3,31,,2,1,2,,,,1,1,1,1,,1,1,,,505003,7,4,1,6,54170,E119,I48,I259,,,,,,,,,,,,71,2105,1,4,5,5,5,30,123021443,2,2,XXXX,11,1,128011531,119021362,I110
1,22APR2012:00:00:00,9,11,2012,1.238301676,1.235974889,78,2101,,2,,4,3,2,2201,2,,,7,,,1,1,,,,0,2,,,5,1,1,,1,1,,,,,,,1,,,,,,310,1,,11,13,,,,1,1,,1,5,,1,1201,7,,6,,,,17,5,,3,,,,2,,,,2151,1,10,,,330,,5,,1,,,,,,,,8,5,,,1,2,1,1,0,2,1,,,202015,9,1,3,4,21010,C19,G952,I509,,T179,,,,,,,,,,86,1101,1,7,4,4,1,50,503021040,1,3,XXXX,61,4,211041269,211011253,I500
1,13DEC2011:00:00:00,4,10,2012,1.238301676,1.198362859,81,2101,,1,,1,3,1,8204,2,,,0,,,1,1,,,,,,,,5,2,1,,,1,3,,,,11,3122,1,,,11,13,,310,3,6,9,,,,3,1,1,1,1,4,,1,,7,,6,,1,,,5,,3,,1,,3,,80901,,7010,,,,,,,,,2,,,,11,1,,1,,1,,,1,2,2,1,1,,1,,4,305003,9,8,9,1,58050,G309,G473,I259,,,,,,,,,,,,84,1101,1,1,2,1,,10,111031235,2,4,1966,30,3,506021122,105031101,R688
1,31MAR2012:00:00:00,29,6,2011,1.222101528,1.20030404,84,,,1,3,3,,1,1101,2,3,,,,,1,1,,,0,0,2,,,5,1,1,,,6,,,,11,5,,,,,13,11,622,,,,,9,,,1,1,1,,1,6,6419,1,1201,7,19,6,,1,,,2,6,3,,,11,,1343,,,2071,,71,73,,170,8,4,,1,,,,11,1,1,,1,,33,,1,2,1,1,3,,1,,,107008,4,3,4,1,32070,J189,E149,I509,J449,I64,,,,,,,,,,89,1101,1,8,4,1,2,52,112021248,2,2,XXXX,21,3,404031107,211011256,I219
1,09FEB2012:00:00:00,15,6,2012,1.188585608,1.220870543,44,2101,,1,3,2,3,1,5204,,,,,,,1,1,,,0,0,2,,,5,4,1,,,1,,,,2,,1222,,,,31,,67,,1,,8,12,,,1,1,1,,1,6,,1,1201,,,,32,1,,,1,,3,3,,,1,,,,,1,72,11,,,,1,,1,,1,3,11,1,1,1,0,,,,1,2,1,1,,1,1,1996,,401021,8,2,4,8,31000,C679,G20,,,,,,,,,,,,,83,1101,1,2,3,1,2,10,305041134,2,3,XXXX,42,2,125031482,603031073,W071